Target
Peroxisome proliferator-activated receptor gamma
Ligand
BDBM50148090
Substrate
Meas. Tech.
ChEMBL_153630 (CHEMBL762526)
EC50
170±n/a nM
Citation
 Koyama, HMiller, DJBoueres, JKDesai, RCJones, ABBerger, JPMacNaul, KLKelly, LJDoebber, TWWu, MSZhou, GWang, PRIppolito, MCChao, YSAgrawal, AKFranklin, RHeck, JVWright, SDMoller, DESahoo, SP (2R)-2-ethylchromane-2-carboxylic acids: discovery of novel PPARalpha/gamma dual agonists as antihyperglycemic and hypolipidemic agents. J Med Chem 47:3255-63 (2004)  
Target
Name:
Peroxisome proliferator-activated receptor gamma
Synonyms:
NR1C3 PPAR-gamma PPARG_HUMAN Peroxisome proliferator-activated receptor gamma (PPAR gamma) Peroxisome proliferator-activated receptor gamma (PPARĪ³) peroxisome proliferator-activated receptor gamma isoform 2
Type:
Nuclear Receptor
Mol. Mass.:
57613.46
Organism:
Homo sapiens (Human)
Description:
P37231
Residue:
505
  
Inhibitor
Name:
BDBM50148090
Synonyms:
(R)-7-{3-[2-Chloro-4-(4-fluoro-phenoxy)-phenoxy]-propoxy}-2-ethyl-chroman-2-carboxylic acid | CHEMBL112725
Type:
Small organic molecule
Emp. Form.:
C27H26ClFO6
Mol. Mass.:
500.943
SMILES:
CC[C@@]1(CCc2ccc(OCCCOc3ccc(Oc4ccc(F)cc4)cc3Cl)cc2O1)C(O)=O
: