Target
Peroxisome proliferator-activated receptor gamma
Ligand
BDBM50148104
Substrate
Meas. Tech.
ChEMBL_154206 (CHEMBL759451)
IC50
>15000±n/a nM
Citation
 Koyama, HMiller, DJBoueres, JKDesai, RCJones, ABBerger, JPMacNaul, KLKelly, LJDoebber, TWWu, MSZhou, GWang, PRIppolito, MCChao, YSAgrawal, AKFranklin, RHeck, JVWright, SDMoller, DESahoo, SP (2R)-2-ethylchromane-2-carboxylic acids: discovery of novel PPARalpha/gamma dual agonists as antihyperglycemic and hypolipidemic agents. J Med Chem 47:3255-63 (2004)  
Target
Name:
Peroxisome proliferator-activated receptor gamma
Synonyms:
NR1C3 PPAR-gamma PPARG_HUMAN Peroxisome proliferator-activated receptor gamma (PPAR gamma) Peroxisome proliferator-activated receptor gamma (PPARĪ³) peroxisome proliferator-activated receptor gamma isoform 2
Type:
Nuclear Receptor
Mol. Mass.:
57613.46
Organism:
Homo sapiens (Human)
Description:
P37231
Residue:
505
  
Inhibitor
Name:
BDBM50148104
Synonyms:
2-Ethyl-7-[3-(4-phenoxy-phenoxy)-propoxy]-chroman-2-carboxylic acid | CHEMBL419019
Type:
Small organic molecule
Emp. Form.:
C27H28O6
Mol. Mass.:
448.5076
SMILES:
CCC1(CCc2ccc(OCCCOc3ccc(Oc4ccccc4)cc3)cc2O1)C(O)=O
: