Target
Peroxisome proliferator-activated receptor gamma
Ligand
BDBM50148095
Substrate
Meas. Tech.
ChEMBL_154206 (CHEMBL759451)
IC50
2300±n/a nM
Citation
 Koyama, HMiller, DJBoueres, JKDesai, RCJones, ABBerger, JPMacNaul, KLKelly, LJDoebber, TWWu, MSZhou, GWang, PRIppolito, MCChao, YSAgrawal, AKFranklin, RHeck, JVWright, SDMoller, DESahoo, SP (2R)-2-ethylchromane-2-carboxylic acids: discovery of novel PPARalpha/gamma dual agonists as antihyperglycemic and hypolipidemic agents. J Med Chem 47:3255-63 (2004)  
Target
Name:
Peroxisome proliferator-activated receptor gamma
Synonyms:
NR1C3 PPAR-gamma PPARG_HUMAN Peroxisome proliferator-activated receptor gamma (PPAR gamma) Peroxisome proliferator-activated receptor gamma (PPARĪ³) peroxisome proliferator-activated receptor gamma isoform 2
Type:
Nuclear Receptor
Mol. Mass.:
57613.46
Organism:
Homo sapiens (Human)
Description:
P37231
Residue:
505
  
Inhibitor
Name:
BDBM50148095
Synonyms:
2-Methyl-6-[4-(4-phenoxy-2-propyl-phenoxy)-butoxy]-chroman-2-carboxylic acid | CHEMBL431450
Type:
Small organic molecule
Emp. Form.:
C30H34O6
Mol. Mass.:
490.5874
SMILES:
CCCc1cc(Oc2ccccc2)ccc1OCCCCOc1ccc2OC(C)(CCc2c1)C(O)=O
: