Target
Nitric oxide synthase, brain
Ligand
BDBM50148163
Substrate
Meas. Tech.
ChEMBL_143364 (CHEMBL751656)
IC50
28000±n/a nM
Citation
 Connolly, SAberg, AArvai, ABeaton, HGCheshire, DRCook, ARCooper, SCox, DHamley, PMallinder, PMillichip, INicholls, DJRosenfeld, RJSt-Gallay, SATainer, JTinker, ACWallace, AV 2-aminopyridines as highly selective inducible nitric oxide synthase inhibitors. Differential binding modes dependent on nitrogen substitution. J Med Chem 47:3320-3 (2004)  
Target
Name:
Nitric oxide synthase, brain
Synonyms:
Constitutive NOS NC-NOS NOS type I nNOS NOS1_HUMAN Neuronal nitric oxide synthase Nitric oxide synthase, neuronal (nNOS) bNOS | nNOS
Type:
Homodimer
Mol. Mass.:
160985.98
Organism:
Homo sapiens (Human)
Description:
P29475
Residue:
1434
  
Inhibitor
Name:
BDBM50148163
Synonyms:
CHEMBL112747 | [4-(4-Methoxy-pyridin-2-ylamino)-piperidin-1-yl]-phenyl-methanone
Type:
Small organic molecule
Emp. Form.:
C18H21N3O2
Mol. Mass.:
311.3782
SMILES:
COc1ccnc(NC2CCN(CC2)C(=O)c2ccccc2)c1
: