Target
Nitric oxide synthase, brain
Ligand
BDBM50148171
Substrate
Meas. Tech.
ChEMBL_143364 (CHEMBL751656)
IC50
>100000±n/a nM
Citation
 Connolly, SAberg, AArvai, ABeaton, HGCheshire, DRCook, ARCooper, SCox, DHamley, PMallinder, PMillichip, INicholls, DJRosenfeld, RJSt-Gallay, SATainer, JTinker, ACWallace, AV 2-aminopyridines as highly selective inducible nitric oxide synthase inhibitors. Differential binding modes dependent on nitrogen substitution. J Med Chem 47:3320-3 (2004)  
Target
Name:
Nitric oxide synthase, brain
Synonyms:
Constitutive NOS NC-NOS NOS type I nNOS NOS1_HUMAN Neuronal nitric oxide synthase Nitric oxide synthase, neuronal (nNOS) bNOS | nNOS
Type:
Homodimer
Mol. Mass.:
160985.98
Organism:
Homo sapiens (Human)
Description:
P29475
Residue:
1434
  
Inhibitor
Name:
BDBM50148171
Synonyms:
4-(Pyridin-2-ylamino)-piperidine-1-carboxylic acid ethyl ester ethyl 4-(pyridin-2-ylamino)piperidine-1-carboxylate
Type:
Small organic molecule
Emp. Form.:
C13H19N3O2
Mol. Mass.:
249.3089
SMILES:
CCOC(=O)N1CCC(CC1)Nc1ccccn1
: