Target
Procathepsin L
Ligand
BDBM50148293
Substrate
Meas. Tech.
ChEBML_48492
IC50
1200±n/a nM
Citation
 Boros, EEDeaton, DNHassell, AMMcFadyen, RBMiller, ABMiller, LRPaulick, MGShewchuk, LMThompson, JBWillard, DHWright, LL Exploration of the P2-P3 SAR of aldehyde cathepsin K inhibitors. Bioorg Med Chem Lett 14:3425-9 (2004)  
Target
Name:
Procathepsin L
Synonyms:
CATL1_HUMAN CTSL CTSL1 Cathepsin L Cathepsin L1 heavy chain MEP cathepsin L preproprotein
Type:
Enzyme
Mol. Mass.:
37557.19
Organism:
Homo sapiens (Human)
Description:
Purchased from Calbiochem (San Diego, CA).
Residue:
333
  
Inhibitor
Name:
BDBM50148293
Synonyms:
((S)-1-Formyl-pentyl)-carbamic acid 1-benzyl-cyclobutyl ester | CHEMBL116724
Type:
Small organic molecule
Emp. Form.:
C18H25NO3
Mol. Mass.:
303.396
SMILES:
CCCC[C@H](NC(=O)OC1(Cc2ccccc2)CCC1)C=O
: