Target
Cathepsin K
Ligand
BDBM50148294
Substrate
Meas. Tech.
ChEBML_45556
IC50
2±n/a nM
Citation
 Boros, EEDeaton, DNHassell, AMMcFadyen, RBMiller, ABMiller, LRPaulick, MGShewchuk, LMThompson, JBWillard, DHWright, LL Exploration of the P2-P3 SAR of aldehyde cathepsin K inhibitors. Bioorg Med Chem Lett 14:3425-9 (2004)  
Target
Name:
Cathepsin K
Synonyms:
CATK_HUMAN CTSO Cathepsin O Cathepsin X
Type:
Enzyme
Mol. Mass.:
36975.68
Organism:
Homo sapiens (Human)
Description:
P43235
Residue:
329
  
Inhibitor
Name:
BDBM50148294
Synonyms:
((S)-1-Formyl-pentyl)-carbamic acid 1-benzyl-cyclohexyl ester | CHEMBL117144
Type:
Small organic molecule
Emp. Form.:
C20H29NO3
Mol. Mass.:
331.4492
SMILES:
CCCC[C@H](NC(=O)OC1(Cc2ccccc2)CCCCC1)C=O
: