Target
Cathepsin K
Ligand
BDBM50148310
Substrate
Meas. Tech.
ChEBML_45556
IC50
0.130000±n/a nM
Citation
 Boros, EEDeaton, DNHassell, AMMcFadyen, RBMiller, ABMiller, LRPaulick, MGShewchuk, LMThompson, JBWillard, DHWright, LL Exploration of the P2-P3 SAR of aldehyde cathepsin K inhibitors. Bioorg Med Chem Lett 14:3425-9 (2004)  
Target
Name:
Cathepsin K
Synonyms:
CATK_HUMAN CTSO Cathepsin O Cathepsin X
Type:
Enzyme
Mol. Mass.:
36975.68
Organism:
Homo sapiens (Human)
Description:
P43235
Residue:
329
  
Inhibitor
Name:
BDBM50148310
Synonyms:
((S)-1-Formyl-pentyl)-carbamic acid (S)-1-benzyl-propyl ester | CHEMBL114462
Type:
Small organic molecule
Emp. Form.:
C17H25NO3
Mol. Mass.:
291.3853
SMILES:
CCCC[C@H](NC(=O)O[C@@H](CC)Cc1ccccc1)C=O
: