Target
Beta-3 adrenergic receptor
Ligand
BDBM50148488
Substrate
Meas. Tech.
ChEBML_39051
Ki
3100±n/a nM
Target
Name:
Beta-3 adrenergic receptor
Synonyms:
ADRB3 ADRB3_HUMAN Beta-2 adrenergic receptor and beta-3 adrenergic receptor Beta-3 adrenoreceptor | adrenergic Beta3
Type:
G Protein-Coupled Receptor (GPCR)
Mol. Mass.:
43534.88
Organism:
Homo sapiens (Human)
Description:
Residue:
408
  
Inhibitor
Name:
BDBM50148488
Synonyms:
(S)-2-[2-Hydroxy-2-((R)-4-hydroxy-3-methanesulfonylamino-phenyl)-ethylamino]-2-(4-methoxy-phenyl)-N-(2-methoxy-phenyl)-propionamide | CHEMBL325853
Type:
Small organic molecule
Emp. Form.:
C26H31N3O7S
Mol. Mass.:
529.605
SMILES:
COc1ccc(cc1)[C@](C)(NC[C@H](O)c1ccc(O)c(NS(C)(=O)=O)c1)C(=O)Nc1ccccc1OC
: