Target
Beta-3 adrenergic receptor
Ligand
BDBM50148495
Substrate
Meas. Tech.
ChEBML_39051
Ki
33000±n/a nM
Target
Name:
Beta-3 adrenergic receptor
Synonyms:
ADRB3 ADRB3_HUMAN Beta-2 adrenergic receptor and beta-3 adrenergic receptor Beta-3 adrenoreceptor | adrenergic Beta3
Type:
G Protein-Coupled Receptor (GPCR)
Mol. Mass.:
43534.88
Organism:
Homo sapiens (Human)
Description:
Residue:
408
  
Inhibitor
Name:
BDBM50148495
Synonyms:
(S)-(S)-2-[2-Hydroxy-2-((R)-4-hydroxy-3-methanesulfonylamino-phenyl)-ethylamino]-2-(4-methoxy-phenyl)-N-methyl-N-phenyl-acetamide | CHEMBL119539
Type:
Small organic molecule
Emp. Form.:
C25H29N3O6S
Mol. Mass.:
499.579
SMILES:
COc1ccc(cc1)[C@H](NC[C@H](O)c1ccc(O)c(NS(C)(=O)=O)c1)C(=O)N(C)c1ccccc1
: