Target
Beta-3 adrenergic receptor
Ligand
BDBM50148502
Substrate
Meas. Tech.
ChEBML_39051
Ki
77±n/a nM
Target
Name:
Beta-3 adrenergic receptor
Synonyms:
ADRB3 ADRB3_HUMAN Beta-2 adrenergic receptor and beta-3 adrenergic receptor Beta-3 adrenoreceptor | adrenergic Beta3
Type:
G Protein-Coupled Receptor (GPCR)
Mol. Mass.:
43534.88
Organism:
Homo sapiens (Human)
Description:
Residue:
408
  
Inhibitor
Name:
BDBM50148502
Synonyms:
(R)-(S)-2-[2-Hydroxy-2-((R)-4-hydroxy-3-methanesulfonylamino-phenyl)-ethylamino]-2-(4-methoxy-phenyl)-N-phenyl-acetamide (S)-2-((R)-2-hydroxy-2-(4-hydroxy-3-(methylsulfonamido)phenyl)ethylamino)-2-(4-methoxyphenyl)-N-phenylacetamide | CHEMBL117577
Type:
Small organic molecule
Emp. Form.:
C24H27N3O6S
Mol. Mass.:
485.553
SMILES:
COc1ccc(cc1)[C@H](NC[C@H](O)c1ccc(O)c(NS(C)(=O)=O)c1)C(=O)Nc1ccccc1
: