Target
Dipeptidase 1
Ligand
BDBM50148530
Substrate
Meas. Tech.
ChEMBL_192703 (CHEMBL801733)
IC50
350±n/a nM
Citation
 Gurulingappa, HBuckhalts, PKinzler, KWVogelstein, BKhan, SR Synthesis and evaluation of aminophosphinic acid derivatives as inhibitors of renal dipeptidase. Bioorg Med Chem Lett 14:3531-3 (2004)  
Target
Name:
Dipeptidase 1
Synonyms:
DPEP1 Dehydropeptidase-I Dipeptidase 1 Microsomal dipeptidase Renal dipeptidase | hRDP
Type:
Protein
Mol. Mass.:
45670.34
Organism:
Homo sapiens (Human)
Description:
P16444
Residue:
411
  
Inhibitor
Name:
BDBM50148530
Synonyms:
2-[(1-Amino-2-cyclohexyl-ethyl)-hydroxy-phosphinoylmethyl]-3-(3-chloro-4-fluoro-phenyl)-acrylic acid CHEMBL334143
Type:
Small organic molecule
Emp. Form.:
C18H24ClFNO4P
Mol. Mass.:
403.813
SMILES:
OC(=O)C(Cc1ccc(F)c(Cl)c1)CP(O)(=O)C(=N)CC1CCCCC1
: