Target
Melanocortin receptor 4
Ligand
BDBM50148975
Substrate
Meas. Tech.
ChEBML_106507
Ki
1600±n/a nM
Citation
 Marsilje, THRoses, JBCalderwood, EFStroud, SGForsyth, NEBlackburn, CYowe, DLMiao, WDrabic, SVBohane, MDScott Daniels, JLi, PWu, LPatane, MAClaiborne, CF Synthesis and biological evaluation of imidazole-based small molecule antagonists of the melanocortin 4 receptor (MC4-R). Bioorg Med Chem Lett 14:3721-5 (2004)  
Target
Name:
Melanocortin receptor 4
Synonyms:
MC4-R MC4R_HUMAN Melanocortin receptor 4 (MC-4) Melanocortin receptor 4 (MC4R)
Type:
Enzyme
Mol. Mass.:
36949.50
Organism:
Homo sapiens (Human)
Description:
P32245
Residue:
332
  
Inhibitor
Name:
BDBM50148975
Synonyms:
2-{2-[2-(5-Bromo-2-methoxy-phenyl)-ethyl]-phenyl}-4-isopropyl-1-methyl-1H-imidazole | CHEMBL332382
Type:
Small organic molecule
Emp. Form.:
C22H25BrN2O
Mol. Mass.:
413.351
SMILES:
COc1ccc(Br)cc1CCc1ccccc1-c1nc(cn1C)C(C)C
: