Target
Estrogen receptor
Ligand
BDBM50144849
Substrate
Meas. Tech.
ChEBML_67368
IC50
0.800000±n/a nM
Citation
 Tan, QBirzin, ETChan, WYang, YTPai, LYHayes, ECDaSilva, CADiNinno, FRohrer, SPSchaeffer, JMHammond, ML Estrogen receptor ligands. Part 6: Synthesis and binding affinity of dihydrobenzodithiins. Bioorg Med Chem Lett 14:3753-5 (2004)  
Target
Name:
Estrogen receptor
Synonyms:
ER ESR ESR1_HUMAN Estrogen receptor Estrogen receptor (ER-alpha) Estrogen receptor alpha (ER) Nuclear receptor subfamily 3 group A member 1
Type:
Protein
Mol. Mass.:
66230.44
Organism:
Homo sapiens (Human)
Description:
P03372
Residue:
595
  
Inhibitor
Name:
BDBM50144849
Synonyms:
(2S,3R)-2-(4-(2-(PIPERIDIN-1-YL)ETHOXY)PHENYL)-2,3-DIHYDRO-3-(4-HYDROXYPHENYL)BENZO[B][1,4]OXATHIIN-6-OL CHEMBL304552
Type:
Small organic molecule
Emp. Form.:
C27H29NO4S
Mol. Mass.:
463.588
SMILES:
Oc1ccc(cc1)[C@H]1Sc2cc(O)ccc2O[C@H]1c1ccc(OCCN2CCCCC2)cc1
: