Target
Neuronal acetylcholine receptor subunit alpha-7
Ligand
BDBM50149147
Substrate
Meas. Tech.
ChEBML_143096
IC50
130±n/a nM
Citation
 Tatsumi, RSeio, KFujio, MKatayama, JHorikawa, THashimoto, KTanaka, H (+)-3-[2-(Benzo[b]thiophen-2-yl)-2-oxoethyl]-1-azabicyclo[2.2.2]octane as potent agonists for the alpha7 nicotinic acetylcholine receptor. Bioorg Med Chem Lett 14:3781-4 (2004)  
Target
Name:
Neuronal acetylcholine receptor subunit alpha-7
Synonyms:
ACHA7_RAT Cholinergic, Nicotinic Alpha7 Chrna7 Neuronal acetylcholine receptor (alpha7 nAChR) Neuronal acetylcholine receptor subunit alpha-7 Neuronal acetylcholine receptor subunit alpha-7 (nAChR)
Type:
Enzyme
Mol. Mass.:
56502.44
Organism:
Rattus norvegicus (Rat)
Description:
Q05941
Residue:
502
  
Inhibitor
Name:
BDBM50149147
Synonyms:
2-(1-Aza-bicyclo[2.2.2]oct-3-yl)-1-benzo[b]thiophen-2-yl-ethanone | CHEMBL420156
Type:
Small organic molecule
Emp. Form.:
C17H19NOS
Mol. Mass.:
285.404
SMILES:
O=C(CC1CN2CCC1CC2)c1cc2ccccc2s1
: