Target
Neuronal acetylcholine receptor subunit alpha-7
Ligand
BDBM50149150
Substrate
Meas. Tech.
ChEBML_143096
IC50
760±n/a nM
Citation
 Tatsumi, RSeio, KFujio, MKatayama, JHorikawa, THashimoto, KTanaka, H (+)-3-[2-(Benzo[b]thiophen-2-yl)-2-oxoethyl]-1-azabicyclo[2.2.2]octane as potent agonists for the alpha7 nicotinic acetylcholine receptor. Bioorg Med Chem Lett 14:3781-4 (2004)  
Target
Name:
Neuronal acetylcholine receptor subunit alpha-7
Synonyms:
ACHA7_RAT Cholinergic, Nicotinic Alpha7 Chrna7 Neuronal acetylcholine receptor (alpha7 nAChR) Neuronal acetylcholine receptor subunit alpha-7 Neuronal acetylcholine receptor subunit alpha-7 (nAChR)
Type:
Enzyme
Mol. Mass.:
56502.44
Organism:
Rattus norvegicus (Rat)
Description:
Q05941
Residue:
502
  
Inhibitor
Name:
BDBM50149150
Synonyms:
3-(2,4-Dimethoxy-benzyl)-[2,3']bipyridinyl | CHEMBL331299
Type:
Small organic molecule
Emp. Form.:
C19H18N2O2
Mol. Mass.:
306.3584
SMILES:
COc1ccc(Cc2cccnc2-c2cccnc2)c(OC)c1
: