Target
Gonadotropin-releasing hormone receptor
Ligand
BDBM50132728
Substrate
Meas. Tech.
ChEMBL_71435 (CHEMBL685307)
Ki
34±n/a nM
Citation
 Tucci, FCZhu, YFGuo, ZGross, TDConnors, PJGao, YRowbottom, MWStruthers, RSReinhart, GJXie, QChen, TKBozigian, HKillam Bonneville, ALFisher, AJin, LSaunders, JChen, C 3-(2-aminoalkyl)-1-(2,6-difluorobenzyl)-5- (2-fluoro-3-methoxyphenyl)-6-methyl-uracils as orally bioavailable antagonists of the human gonadotropin releasing hormone receptor. J Med Chem 47:3483-6 (2004)  
Target
Name:
Gonadotropin-releasing hormone receptor
Synonyms:
GNRHR GRHR GnRH-R Gonadotropin-releasing hormone receptor | Gonadotropin-releasing hormone receptor (GnRH)
Type:
Enzyme
Mol. Mass.:
37749.45
Organism:
Homo sapiens (Human)
Description:
P30968
Residue:
328
  
Inhibitor
Name:
BDBM50132728
Synonyms:
1-(2,6-Difluoro-benzyl)-5-(3-methoxy-phenyl)-6-methyl-3-{2-[methyl-(2-pyridin-2-yl-ethyl)-amino]-ethyl}-1H-pyrimidine-2,4-dione | CHEMBL23830
Type:
Small organic molecule
Emp. Form.:
C29H30F2N4O3
Mol. Mass.:
520.5703
SMILES:
COc1cccc(c1)-c1c(C)n(Cc2c(F)cccc2F)c(=O)n(CCN(C)CCc2ccccn2)c1=O
: