Target
Camphor 5-monooxygenase
Ligand
BDBM50149353
Substrate
Meas. Tech.
ChEMBL_96558 (CHEMBL709291)
IC50
129000±n/a nM
Citation
 Verras, AKuntz, IDOrtiz de Montellano, PR Computer-assisted design of selective imidazole inhibitors for cytochrome p450 enzymes. J Med Chem 47:3572-9 (2004)  
Target
Name:
Camphor 5-monooxygenase
Synonyms:
CPXA_PSEPU camC | cyp101
Type:
PROTEIN
Mol. Mass.:
46658.12
Organism:
Pseudomonas putida
Description:
ChEMBL_52092
Residue:
415
  
Inhibitor
Name:
BDBM50149353
Synonyms:
1-Cyclopropyl-5-(2,2-dimethyl-propyl)-1H-imidazole | CHEMBL118854
Type:
Small organic molecule
Emp. Form.:
C11H18N2
Mol. Mass.:
178.274
SMILES:
CC(C)(C)Cc1cncn1C1CC1
: