Target
Camphor 5-monooxygenase
Ligand
BDBM50149354
Substrate
Meas. Tech.
ChEMBL_96558 (CHEMBL709291)
IC50
6500±n/a nM
Citation
 Verras, AKuntz, IDOrtiz de Montellano, PR Computer-assisted design of selective imidazole inhibitors for cytochrome p450 enzymes. J Med Chem 47:3572-9 (2004)  
Target
Name:
Camphor 5-monooxygenase
Synonyms:
CPXA_PSEPU camC | cyp101
Type:
PROTEIN
Mol. Mass.:
46658.12
Organism:
Pseudomonas putida
Description:
ChEMBL_52092
Residue:
415
  
Inhibitor
Name:
BDBM50149354
Synonyms:
1-cyclopentyl-5-propyl-1H-imidazole | CHEMBL120774
Type:
Small organic molecule
Emp. Form.:
C11H18N2
Mol. Mass.:
178.274
SMILES:
CCCc1cncn1C1CCCC1
: