Target
Metallo-beta-lactamase type 2
Ligand
BDBM50149467
Substrate
Meas. Tech.
ChEMBL_41202 (CHEMBL652838)
IC50
240±0 nM
Citation
 Tabei, KFeng, XVenkatesan, AMAbe, THideki, UMansour, TSSiegel, MM Mechanism of inactivation of beta-lactamases by novel 6-methylidene penems elucidated using electrospray ionization mass spectrometry. J Med Chem 47:3674-88 (2004)  
Target
Name:
Metallo-beta-lactamase type 2
Synonyms:
BLAB_BACFG ccrA | cfiA
Type:
PROTEIN
Mol. Mass.:
27252.87
Organism:
Bacteroides fragilis
Description:
ChEMBL_1502123
Residue:
249
  
Inhibitor
Name:
BDBM50149467
Synonyms:
(5R,6Z)-6-(6,7-dihydro-5H-cyclopenta-[d]imidazo[2,1-b][1,3]thiazol-2-ylmethylene)-7-oxo-4-thia-1-azabicyclo[3.2.0]hept-2-ene-2-carboxylic acid sodium Sodium; (R)-6-[1-(6,7-dihydro-5H-cyclopenta[d]imidazo[2,1-b]thiazol-2-yl)-meth-(Z)-ylidene]-7-oxo-4-thia-1-aza-bicyclo[3.2.0]hept-2-ene-2-carboxylate | sodium (R)-6-[1-(6,7-dihydro-5H-cyclopenta[d]imidazo[2,1-b]thiazol-2-yl)-meth-(Z)-ylidene]-7-oxo-4-thia-1-aza-bicyclo[3.2.0]hept-2-ene-2-carboxylate
Type:
Small organic molecule
Emp. Form.:
C15H10N3O3S2
Mol. Mass.:
344.389
SMILES:
[O-]C(=O)C1=CS[C@H]2N1C(=O)\C2=C\c1cn2c3CCCc3sc2n1
: