Target
Beta-lactamase
Ligand
BDBM50149788
Substrate
Meas. Tech.
ChEMBL_302784 (CHEMBL839469)
Ki
700±n/a nM
Citation
 Buzzoni, VBlazquez, JFerrari, SCalò, SVenturelli, ACosti, MP Aza-boronic acids as non-beta-lactam inhibitors of AmpC-beta-lactamase. Bioorg Med Chem Lett 14:3979-83 (2004)  
Target
Name:
Beta-lactamase
Synonyms:
AMPC_ECOLI Beta-lactamase (AmpC) Cephalosporinase ampA | ampC
Type:
Protien
Mol. Mass.:
41561.62
Organism:
Escherichia coli
Description:
P00811
Residue:
377
  
Inhibitor
Name:
BDBM50149788
Synonyms:
Aza-boronic acid derivative | CHEMBL182522
Type:
Small organic molecule
Emp. Form.:
C22H17BN4O5
Mol. Mass.:
428.205
SMILES:
OB(O)c1cccc(c1)N=Nc1ccc(cc1O)N=Nc1c(O)cc(O)c2ccccc12
: