Target
Inhibitor of nuclear factor kappa-B kinase subunit beta
Ligand
BDBM50149850
Substrate
Meas. Tech.
ChEMBL_306083 (CHEMBL833584)
IC50
15±n/a nM
Citation
 Murata, TShimada, MSakakibara, SYoshino, TMasuda, TShintani, TSato, HKoriyama, YFukushima, KNunami, NYamauchi, MFuchikami, KKomura, HWatanabe, AZiegelbauer, KBBacon, KBLowinger, TB Synthesis and structure-activity relationships of novel IKK-beta inhibitors. Part 3: Orally active anti-inflammatory agents. Bioorg Med Chem Lett 14:4019-22 (2004)  
Target
Name:
Inhibitor of nuclear factor kappa-B kinase subunit beta
Synonyms:
I-kappa-B Kinase 2 (IKK-beta) I-kappa-B-kinase beta IKBKB IKK-beta IKK2/IKK1 IKKB_HUMAN Inhibitor of nuclear factor kappa B kinase beta subunit Nuclear factor NF-kappa-B inhibitor kinase beta
Type:
Serine/threonine-protein kinase
Mol. Mass.:
86554.39
Organism:
Homo sapiens (Human)
Description:
GST-tagged IKK-2 was expressed in High Five cells and purified.
Residue:
756
  
Inhibitor
Name:
BDBM50149850
Synonyms:
2-Amino-6-(2-butoxy-6-hydroxy-phenyl)-1'',2'',3'',4'',5'',6''-hexahydro-[4,4'']bipyridinyl-3-carbonitrile | CHEMBL360337
Type:
Small organic molecule
Emp. Form.:
C21H26N4O2
Mol. Mass.:
366.4567
SMILES:
CCCCOc1cccc(O)c1-c1cc(C2CCNCC2)c(C#N)c(N)n1
: