Target
5-hydroxytryptamine receptor 1A
Ligand
BDBM50150100
Substrate
Meas. Tech.
ChEMBL_611 (CHEMBL615161)
EC50
4±n/a nM
Citation
 Mewshaw, REZhou, DZhou, PShi, XHornby, GSpangler, TScerni, RSmith, DSchechter, LEAndree, TH Studies toward the discovery of the next generation of antidepressants. 3. Dual 5-HT1A and serotonin transporter affinity within a class of N-aryloxyethylindolylalkylamines. J Med Chem 47:3823-42 (2004)  
Target
Name:
5-hydroxytryptamine receptor 1A
Synonyms:
5-HT-1A 5-hydroxytryptamine receptor 1A (5-HT-1A) ADRB2RL1 Dopamine D2 receptor and serotonin 1a receptor HTR1A | Serotonin receptor 1A
Type:
Mol. Mass.:
46122.49
Organism:
Homo sapiens (Human)
Description:
Residue:
422
  
Inhibitor
Name:
BDBM50150100
Synonyms:
CHEMBL340301 | [2-(1H-Indol-4-yloxy)-ethyl]-[3-(1H-indol-3-yl)-propyl]-amine
Type:
Small organic molecule
Emp. Form.:
C21H23N3O
Mol. Mass.:
333.4268
SMILES:
C(CNCCOc1cccc2[nH]ccc12)Cc1c[nH]c2ccccc12
: