Target
Melanocortin receptor 5
Ligand
BDBM50150829
Substrate
Meas. Tech.
ChEMBL_303300 (CHEMBL827433)
Ki
11±n/a nM
Citation
 Chen, CYu, JFleck, BAHoare, SRSaunders, JFoster, AC Phenylguanidines as selective nonpeptide melanocortin-5 receptor antagonists. J Med Chem 47:4083-8 (2004)  
Target
Name:
Melanocortin receptor 5
Synonyms:
MC-2 MC5R Melanocortin MC5 Melanocortin receptor 5 | Melanocortin receptor 5 (MC5R)
Type:
Enzyme
Mol. Mass.:
36612.92
Organism:
Homo sapiens (Human)
Description:
P33032
Residue:
325
  
Inhibitor
Name:
BDBM50150829
Synonyms:
4-[(N-Cyclohexyl-3,5-dimethyl-piperazine-1-carboximidoyl)-amino]-N-[2-(2,4-dichloro-phenyl)-ethyl]-benzamide | CHEMBL363730
Type:
Small organic molecule
Emp. Form.:
C28H37Cl2N5O
Mol. Mass.:
530.532
SMILES:
CC1CN(CC(C)N1)C(Nc1ccc(cc1)C(=O)NCCc1ccc(Cl)cc1Cl)=NC1CCCCC1
: