Target
Protein c-Fos/Transcription factor Jun
Ligand
BDBM50151088
Substrate
Meas. Tech.
ChEMBL_305353 (CHEMBL832733)
IC50
>100000±n/a nM
Citation
 Tsuchida, KChaki, HTakakura, TYokotani, JAikawa, YShiozawa, SGouda, HHirono, S Design, synthesis, and biological evaluation of new cyclic disulfide decapeptides that inhibit the binding of AP-1 to DNA. J Med Chem 47:4239-46 (2004)  
Target
Name:
Protein c-Fos/Transcription factor Jun
Synonyms:
Proto-oncogene c-JUN/protein c-fos | Transcription factor AP1
Type:
Mol. Mass.:
Description:
ASSAY_ID of EBI is 305353
Components:
This complex has 2 components.
Component 1
Name:
Transcription factor Jun
Synonyms:
AP1 JUN Proto-oncogene c-JUN Transcription factor AP1 p39
Type:
Mol. Mass.:
35683.24
Organism:
Homo sapiens (Human)
Description:
P05412
Residue:
331
  
Component 2
Name:
Protein c-Fos
Synonyms:
FOS G0S7 | Transcription factor AP1
Type:
PROTEIN
Mol. Mass.:
40679.34
Organism:
Homo sapiens (Human)
Description:
EBI_100167
Residue:
380
  
Inhibitor
Name:
BDBM50151088
Synonyms:
(S)-3-{(S)-2-[(S)-2-((S)-2-{(S)-2-[(S)-2-(2-Amino-acetylamino)-4-carbamoyl-butyrylamino]-4-methyl-pentanoylamino}-3-carboxy-propionylamino)-3-cyclohexyl-propionylamino]-propionylamino}-N-carboxymethyl-succinamic acid | CHEMBL189749
Type:
Small organic molecule
Emp. Form.:
C35H57N9O14
Mol. Mass.:
827.879
SMILES:
CC(C)C[C@H](NC(=O)[C@H](CCC(N)=O)NC(=O)CN)C(=O)N[C@@H](CC(O)=O)C(=O)N[C@@H](CC1CCCCC1)C(=O)N[C@@H](C)C(=O)N[C@@H](CC(O)=O)C(=O)NCC(O)=O
: