Target
Bifunctional dihydrofolate reductase-thymidylate synthase
Ligand
BDBM18787
Substrate
Meas. Tech.
ChEMBL_302861 (CHEMBL828776)
Ki
13.0±n/a nM
Citation
 Parenti, MDPacchioni, SFerrari, AMRastelli, G Three-dimensional quantitative structure-activity relationship analysis of a set of Plasmodium falciparum dihydrofolate reductase inhibitors using a pharmacophore generation approach. J Med Chem 47:4258-67 (2004)  
Target
Name:
Bifunctional dihydrofolate reductase-thymidylate synthase
Synonyms:
DHFR-TS Dihydrofolate Reductase-Thymidylate Synthase (DHFR-TS) Mutant KICB1 PfDHFR-TS double mutant (C59R+S108N)
Type:
Enzyme
Mol. Mass.:
71822.51
Organism:
Plasmodium falciparum (isolate K1 / Thailand)
Description:
The mutant clone was prepared by cassette mutagenesis using wildtype pfDHFR as a template, and expressed in E. coli.
Residue:
608
  
Inhibitor
Name:
BDBM18787
Synonyms:
5-(3-chlorophenyl)-6-[2-(3-phenoxypropoxy)ethyl]pyrimidine-2,4-diamine P40
Type:
Small organic molecule
Emp. Form.:
C21H23ClN4O2
Mol. Mass.:
398.886
SMILES:
Nc1nc(N)c(c(CCOCCCOc2ccccc2)n1)-c1cccc(Cl)c1
: