Target
Growth hormone secretagogue receptor type 1
Ligand
BDBM50151157
Substrate
Meas. Tech.
ChEMBL_303373 (CHEMBL839691)
Ki
1370±n/a nM
Citation
 Shoda, MHarada, TKogami, YTsujita, RAkashi, HKouji, HStahura, FLXue, LBajorath, J Identification of structurally diverse growth hormone secretagogue agonists by virtual screening and structure-activity relationship analysis of 2-formylaminoacetamide derivatives. J Med Chem 47:4286-90 (2004)  
Target
Name:
Growth hormone secretagogue receptor type 1
Synonyms:
GH-releasing peptide receptor GHS-R GHSR_HUMAN Ghrelin receptor | Ghrelin receptor 1a (GHS-R1a)
Type:
Receptor
Mol. Mass.:
41334.57
Organism:
Homo sapiens (Human)
Description:
Receptor binding studies use plasma membranes from LLC PK-1 cells transiently transfected with hGHSR1a.
Residue:
366
  
Inhibitor
Name:
BDBM50151157
Synonyms:
5-Phenyl-1H-pyrrole-2-carboxylic acid [cyclohexylcarbamoyl-(4-fluoro-phenyl)-methyl]-(2-diethylamino-ethyl)-amide | CHEMBL188582
Type:
Small organic molecule
Emp. Form.:
C31H39FN4O2
Mol. Mass.:
518.6654
SMILES:
CCN(CC)CCN(C(C(=O)NC1CCCCC1)c1ccc(F)cc1)C(=O)c1ccc([nH]1)-c1ccccc1
: