Target
Adenosine receptor A2a
Ligand
BDBM50151182
Substrate
Meas. Tech.
ChEMBL_303190 (CHEMBL829684)
Ki
3±n/a nM
Citation
 Vu, CBPeng, BKumaravel, GSmits, GJin, XPhadke, DEngber, THuang, CReilly, JTam, SGrant, DHetu, GChen, LZhang, JPetter, RC Piperazine derivatives of [1,2,4]triazolo[1,5-a][1,3,5]triazine as potent and selective adenosine A2a receptor antagonists. J Med Chem 47:4291-9 (2004)  
Target
Name:
Adenosine receptor A2a
Synonyms:
AA2AR_RAT Adenosine A2 receptor Adenosine Receptors A2a (A2a) Adenosine receptors A2a Rat striatal adenosine A2a receptor
Type:
G Protein-Coupled Receptor (GPCR)
Mol. Mass.:
45015.65
Organism:
Rattus norvegicus (rat)
Description:
Rat A2A receptors expressed in CHO cells.
Residue:
410
  
Inhibitor
Name:
BDBM50151182
Synonyms:
2-Furan-2-yl-5-[4-(2,4,6-trifluoro-benzyl)-piperazin-1-yl]-[1,2,4]triazolo[1,5-a][1,3,5]triazin-7-ylamine | CHEMBL173941
Type:
Small organic molecule
Emp. Form.:
C19H17F3N8O
Mol. Mass.:
430.3865
SMILES:
Nc1nc(nc2nc(nn12)-c1ccco1)N1CCN(Cc2c(F)cc(F)cc2F)CC1
: