Target
cAMP-specific 3',5'-cyclic phosphodiesterase 4D
Ligand
BDBM50151636
Substrate
Meas. Tech.
ChEMBL_306339 (CHEMBL828159)
IC50
2410±n/a nM
Citation
 Bernardelli, PLorthiois, EVergne, FOliveira, CMafroud, AKProust, EPham, NDucrot, PMoreau, FIdrissi, MTertre, ABertin, BCoupe, MChevalier, EDescours, ABerlioz-Seux, FBerna, PLi, M Spiroquinazolinones as novel, potent, and selective PDE7 inhibitors. Part 2: Optimization of 5,8-disubstituted derivatives. Bioorg Med Chem Lett 14:4627-31 (2004)  
Target
Name:
cAMP-specific 3',5'-cyclic phosphodiesterase 4D
Synonyms:
3',5'-cyclic phosphodiesterase PDE43 PDE4D_HUMAN | Phosphodiesterase 4D
Type:
Protein
Mol. Mass.:
91092.69
Organism:
Homo sapiens (Human)
Description:
Q08499
Residue:
809
  
Inhibitor
Name:
BDBM50151636
Synonyms:
3-[8''-chloro-2''-oxospiro[cyclohexane-1,4''-(1'',2'',3'',4''-tetrahydroquinazoline)]-5-yloxy]-1-propanesulfonic acid | CHEMBL360627
Type:
Small organic molecule
Emp. Form.:
C16H21ClN2O5S
Mol. Mass.:
388.866
SMILES:
OS(=O)(=O)CCCOc1ccc(Cl)c2NC(=O)NC3(CCCCC3)c12
: