Target
5-hydroxytryptamine receptor 1D
Ligand
BDBM50151705
Substrate
Meas. Tech.
ChEMBL_302367 (CHEMBL829548)
Ki
0.3±n/a nM
Citation
 Prisinzano, TDukat, MLaw, HSlassi, AMacLean, NDeLannoy, IGlennon, RA 2-(Anilino)imidazolines and 2-(benzyl)imidazoline derivatives as h5-HT1D serotonin receptor ligands. Bioorg Med Chem Lett 14:4697-9 (2004)  
Target
Name:
5-hydroxytryptamine receptor 1D
Synonyms:
5-HT-1D 5-HT1D 5HT1D_HUMAN HTR1DA Serotonin (5-HT) receptor | Serotonin Receptor 1D
Type:
G Protein-Coupled Receptor (GPCR)
Mol. Mass.:
41920.63
Organism:
Homo sapiens (Human)
Description:
Receptor binding assays were performed using human clone stably expressed in CHO cells.
Residue:
377
  
Inhibitor
Name:
BDBM50151705
Synonyms:
(4-tert-Butyl-2,6-dimethyl-phenyl)-(4,5-dihydro-1H-imidazol-2-yl)-amine | CHEMBL366322
Type:
Small organic molecule
Emp. Form.:
C15H23N3
Mol. Mass.:
245.3632
SMILES:
[#6]-c1cc(cc(-[#6])c1\[#7]=[#6]-1/[#7]-[#6]-[#6]-[#7]-1)C([#6])([#6])[#6]
: