Target
D(2) dopamine receptor
Ligand
BDBM50151959
Substrate
Meas. Tech.
ChEBML_305865
IC50
31±n/a nM
Citation
 Heinrich, TBöttcher, HBartoszyk, GDGreiner, HESeyfried, CAVan Amsterdam, C Indolebutylamines as selective 5-HT(1A) agonists. J Med Chem 47:4677-83 (2004)  
Target
Name:
D(2) dopamine receptor
Synonyms:
DOPAMINE D2 DOPAMINE D2 Short Dopamine D2 receptor Drd2
Type:
G Protein-Coupled Receptor (GPCR)
Mol. Mass.:
50931.60
Organism:
Rattus norvegicus (rat)
Description:
P61169
Residue:
444
  
Inhibitor
Name:
BDBM50151959
Synonyms:
3-[4-(4-Phenyl-piperazin-1-yl)-butyl]-1H-indole-5-carboxylic acid methyl ester | CHEMBL188183
Type:
Small organic molecule
Emp. Form.:
C24H29N3O2
Mol. Mass.:
391.506
SMILES:
COC(=O)c1ccc2[nH]cc(CCCCN3CCN(CC3)c3ccccc3)c2c1
: