Target
Adenosine receptor A2a
Ligand
BDBM50152220
Substrate
Meas. Tech.
ChEMBL_303573 (CHEMBL828973)
Ki
10±n/a nM
Citation
 Vu, CBPan, DPeng, BSha, LKumaravel, GJin, XPhadke, DEngber, THuang, CReilly, JTam, SPetter, RC Studies on adenosine A2a receptor antagonists: comparison of three core heterocycles. Bioorg Med Chem Lett 14:4831-4 (2004)  
Target
Name:
Adenosine receptor A2a
Synonyms:
AA2AR_RAT Adenosine A2 receptor Adenosine Receptors A2a (A2a) Adenosine receptors A2a Rat striatal adenosine A2a receptor
Type:
G Protein-Coupled Receptor (GPCR)
Mol. Mass.:
45015.65
Organism:
Rattus norvegicus (rat)
Description:
Rat A2A receptors expressed in CHO cells.
Residue:
410
  
Inhibitor
Name:
BDBM50152220
Synonyms:
CHEMBL183531 | N*7*-[(R)-1-(2-Chloro-pyridin-4-ylmethyl)-pyrrolidin-2-ylmethyl]-2-furan-2-yl-[1,2,4]triazolo[1,5-c]pyrimidine-5,7-diamine
Type:
Small organic molecule
Emp. Form.:
C20H21ClN8O
Mol. Mass.:
424.887
SMILES:
Nc1nc(NC[C@H]2CCCN2Cc2ccnc(Cl)c2)cc2nc(nn12)-c1ccco1
: