Target
Melanin-concentrating hormone receptor 1
Ligand
BDBM50025466
Substrate
Meas. Tech.
ChEMBL_306739 (CHEMBL832326)
IC50
1590±n/a nM
Citation
 Souers, AJWodka, DGao, JLewis, JCVasudevan, AGentles, RBrodjian, SDayton, BOgiela, CAFry, DHernandez, LEMarsh, KCCollins, CAKym, PR Synthesis and evaluation of 2-amino-8-alkoxy quinolines as MCHr1 antagonists. Part 1. Bioorg Med Chem Lett 14:4873-7 (2004)  
Target
Name:
Melanin-concentrating hormone receptor 1
Synonyms:
G-protein coupled receptor 24 MCH receptor 1 MCH-R1 MCHR-1 MCHR1_HUMAN Melanin-Concentrating Hormone Receptor 1 (MCH1R) Melanin-concentrating hormone receptor 1 (MCH-1) Melanin-concentrating hormone receptor 1 (MCHR-1) SLC-1 Somatostatin receptor-like protein
Type:
G Protein-Coupled Receptor (GPCR)
Mol. Mass.:
45976.27
Organism:
Homo sapiens (Human)
Description:
Membranes from CHO-K1 cells stably expressing human MCH1R were used in assays.
Residue:
422
  
Inhibitor
Name:
BDBM50025466
Synonyms:
8-Methoxy-quinolin-2-ylamine | CHEMBL77072
Type:
Small organic molecule
Emp. Form.:
C10H10N2O
Mol. Mass.:
174.1992
SMILES:
COc1cccc2ccc(N)nc12
: