Target
Prostaglandin D2 receptor
Ligand
BDBM50152508
Substrate
Meas. Tech.
ChEMBL_303623 (CHEMBL828834)
Ki
10±n/a nM
Citation
 Torisu, KKobayashi, KIwahashi, MNakai, YOnoda, TNagase, TSugimoto, IOkada, YMatsumoto, RNanbu, FOhuchida, SNakai, HToda, M Discovery of orally active prostaglandin D2 receptor antagonists. Bioorg Med Chem Lett 14:4891-5 (2004)  
Target
Name:
Prostaglandin D2 receptor
Synonyms:
PD2R_MOUSE Ptgdr
Type:
PROTEIN
Mol. Mass.:
40018.63
Organism:
Mus musculus
Description:
ChEMBL_788408
Residue:
357
  
Inhibitor
Name:
BDBM50152508
Synonyms:
CHEMBL364593 | {1-[4-(2,3-Dihydro-benzo[1,4]dioxin-2-ylmethoxy)-benzoyl]-2-methyl-1H-indol-4-yl}-acetic acid
Type:
Small organic molecule
Emp. Form.:
C27H23NO6
Mol. Mass.:
457.4746
SMILES:
Cc1cc2c(CC(O)=O)cccc2n1C(=O)c1ccc(OC[C@@H]2COc3ccccc3O2)cc1
: