Target
DNA excision repair protein ERCC-5
Ligand
BDBM50152551
Substrate
Meas. Tech.
ChEMBL_304836 (CHEMBL827924)
IC50
1850±n/a nM
Citation
 Tumey, LNHuck, BGleason, EWang, JSilver, DBrunden, KBoozer, SRundlett, SSherf, BMurphy, SBailey, ADent, TLeventhal, CHarrington, JBennani, YL The identification and optimization of 2,4-diketobutyric acids as flap endonuclease 1 inhibitors. Bioorg Med Chem Lett 14:4915-8 (2004)  
Target
Name:
DNA excision repair protein ERCC-5
Synonyms:
ERCC5 ERCM2 XPGC
Type:
PROTEIN
Mol. Mass.:
133069.11
Organism:
Homo sapiens (Human)
Description:
ChEMBL_305129
Residue:
1186
  
Inhibitor
Name:
BDBM50152551
Synonyms:
4-[5-(2-Chloro-phenyl)-furan-2-yl]-2,4-dioxo-butyric acid | CHEMBL185257
Type:
Small organic molecule
Emp. Form.:
C14H9ClO5
Mol. Mass.:
292.671
SMILES:
OC(=O)C(=O)CC(=O)c1ccc(o1)-c1ccccc1Cl
: