Target
DNA excision repair protein ERCC-5
Ligand
BDBM50152558
Substrate
Meas. Tech.
ChEMBL_304836 (CHEMBL827924)
IC50
1130±n/a nM
Citation
 Tumey, LNHuck, BGleason, EWang, JSilver, DBrunden, KBoozer, SRundlett, SSherf, BMurphy, SBailey, ADent, TLeventhal, CHarrington, JBennani, YL The identification and optimization of 2,4-diketobutyric acids as flap endonuclease 1 inhibitors. Bioorg Med Chem Lett 14:4915-8 (2004)  
Target
Name:
DNA excision repair protein ERCC-5
Synonyms:
ERCC5 ERCM2 XPGC
Type:
PROTEIN
Mol. Mass.:
133069.11
Organism:
Homo sapiens (Human)
Description:
ChEMBL_305129
Residue:
1186
  
Inhibitor
Name:
BDBM50152558
Synonyms:
4-(4-Chloro-biphenyl-3-yl)-2,4-dioxo-butyric acid | CHEMBL188067
Type:
Small organic molecule
Emp. Form.:
C16H11ClO4
Mol. Mass.:
302.709
SMILES:
OC(=O)C(=O)CC(=O)c1cc(ccc1Cl)-c1ccccc1
: