Target
Gonadotropin-releasing hormone receptor
Ligand
BDBM50152702
Substrate
Meas. Tech.
ChEMBL_303704 (CHEMBL829039)
Ki
42±n/a nM
Citation
 Rowbottom, MWTucci, FCConnors, PJGross, TDZhu, YFGuo, ZMoorjani, MAcevedo, OCarter, LSullivan, SKXie, QFisher, AStruthers, RSSaunders, JChen, C Synthesis and structure-activity relationships of uracil derived human GnRH receptor antagonists: (R)-3-[2-(2-amino)phenethyl]-1-(2,6-difluorobenzyl)-6-methyluracils containing a substituted thiophene or thiazole at C-5. Bioorg Med Chem Lett 14:4967-73 (2004)  
Target
Name:
Gonadotropin-releasing hormone receptor
Synonyms:
GNRHR GRHR GnRH-R Gonadotropin-releasing hormone receptor | Gonadotropin-releasing hormone receptor (GnRH)
Type:
Enzyme
Mol. Mass.:
37749.45
Organism:
Homo sapiens (Human)
Description:
P30968
Residue:
328
  
Inhibitor
Name:
BDBM50152702
Synonyms:
3-((R)-2-Amino-2-phenyl-ethyl)-1-(2,6-difluoro-benzyl)-5-[2-(4-fluoro-phenyl)-thiazol-4-yl]-6-methyl-1H-pyrimidine-2,4-dione | CHEMBL438201
Type:
Small organic molecule
Emp. Form.:
C29H23F3N4O2S
Mol. Mass.:
548.579
SMILES:
Cc1c(-c2csc(n2)-c2ccc(F)cc2)c(=O)n(C[C@H](N)c2ccccc2)c(=O)n1Cc1c(F)cccc1F
: