Target
DNA polymerase alpha catalytic subunit
Ligand
BDBM50153113
Substrate
Meas. Tech.
ChEMBL_306234 (CHEMBL830331)
IC50
8000±n/a nM
Citation
 Oshige, MKuramochi, KOhta, KOgawa, AKuriyama, HSugawara, FKobayashi, SSakaguchi, K Molecular design of cholesterols as inhibitors of DNA polymerase alpha. J Med Chem 47:4971-4 (2004)  
Target
Name:
DNA polymerase alpha catalytic subunit
Synonyms:
DNA polymerase (alpha/delta/epsilon) DPOLA_HUMAN POLA1
Type:
PROTEIN
Mol. Mass.:
165895.25
Organism:
Homo sapiens (Human)
Description:
ChEMBL_1365493
Residue:
1462
  
Inhibitor
Name:
BDBM50153113
Synonyms:
CHEMBL364611 | [(3S,10R,13R,17R)-17-((E)-(1R,4S)-4-Ethyl-1,5-dimethyl-hex-2-enyl)-10,13-dimethyl-2,3,4,7,8,9,10,11,12,13,14,15,16,17-tetradecahydro-1H-cyclopenta[a]phenanthren-3-yloxy]-acetic acid
Type:
Small organic molecule
Emp. Form.:
C31H50O3
Mol. Mass.:
470.7269
SMILES:
CC[C@H](\C=C\[C@@H](C)[C@H]1CCC2C3CC=C4C[C@H](CC[C@]4(C)C3CC[C@]12C)OCC(O)=O)C(C)C
: