Target
Sodium/glucose cotransporter 2
Ligand
BDBM50153308
Substrate
Meas. Tech.
ChEMBL_308700 (CHEMBL834935)
Ki
520±n/a nM
Citation
 Dudash, JZhang, XZeck, REJohnson, SGCox, GGConway, BRRybczynski, PJDemarest, KT Glycosylated dihydrochalcones as potent and selective sodium glucose co-transporter 2 (SGLT2) inhibitors. Bioorg Med Chem Lett 14:5121-5 (2004)  
Target
Name:
Sodium/glucose cotransporter 2
Synonyms:
Na(+)/glucose cotransporter 2 SGLT2 Sodium-Dependent Glucose Cotransporter 2 (SGLT2) Solute carrier family 5 member 2
Type:
Protein
Mol. Mass.:
72902.00
Organism:
Homo sapiens (Human)
Description:
P31639
Residue:
672
  
Inhibitor
Name:
BDBM50153308
Synonyms:
1-[2-Amino-4-methyl-6-(3,4,5-trihydroxy-6-hydroxymethyl-tetrahydro-pyran-2-yloxy)-phenyl]-3-naphthalen-2-yl-propan-1-one | CHEMBL361672
Type:
Small organic molecule
Emp. Form.:
C26H29NO7
Mol. Mass.:
467.511
SMILES:
Cc1cc(N)c(C(=O)CCc2ccc3ccccc3c2)c(O[C@@H]2O[C@H](CO)[C@@H](O)[C@H](O)[C@H]2O)c1
: