Target
Glucocorticoid receptor
Ligand
BDBM50153507
Substrate
Meas. Tech.
ChEMBL_305576 (CHEMBL828024)
IC50
2.4±n/a nM
Citation
 Shah, NScanlan, TS Design and evaluation of novel nonsteroidal dissociating glucocorticoid receptor ligands. Bioorg Med Chem Lett 14:5199-203 (2004)  
Target
Name:
Glucocorticoid receptor
Synonyms:
GCR_RAT Glucocorticoid Receptor (GR) Grl | Nr3c1
Type:
Enzyme Catalytic Domain
Mol. Mass.:
87556.83
Organism:
RAT
Description:
Glucocorticoid 0 RAT::P06536
Residue:
795
  
Inhibitor
Name:
BDBM50153507
Synonyms:
CHEMBL186948 | [(4aR,5S)-1-(4-Fluoro-phenyl)-4a-methyl-4,4a,5,6,7,8-hexahydro-1H-benzo[f]indazol-5-yl]-naphthalen-2-yl-methanol
Type:
Small organic molecule
Emp. Form.:
C29H27FN2O
Mol. Mass.:
438.5359
SMILES:
C[C@]12Cc3cnn(c3C=C1CCC[C@@H]2C(O)c1ccc2ccccc2c1)-c1ccc(F)cc1
: