Target
Glucocorticoid receptor
Ligand
BDBM50153506
Substrate
Meas. Tech.
ChEMBL_305576 (CHEMBL828024)
IC50
7±n/a nM
Citation
 Shah, NScanlan, TS Design and evaluation of novel nonsteroidal dissociating glucocorticoid receptor ligands. Bioorg Med Chem Lett 14:5199-203 (2004)  
Target
Name:
Glucocorticoid receptor
Synonyms:
GCR_RAT Glucocorticoid Receptor (GR) Grl | Nr3c1
Type:
Enzyme Catalytic Domain
Mol. Mass.:
87556.83
Organism:
RAT
Description:
Glucocorticoid 0 RAT::P06536
Residue:
795
  
Inhibitor
Name:
BDBM50153506
Synonyms:
(4-Chloro-phenyl)-[(4aR,5S)-1-(4-fluoro-phenyl)-4a-methyl-4,4a,5,6,7,8-hexahydro-1H-benzo[f]indazol-5-yl]-methanol | CHEMBL362556
Type:
Small organic molecule
Emp. Form.:
C25H24ClFN2O
Mol. Mass.:
422.922
SMILES:
C[C@]12Cc3cnn(c3C=C1CCC[C@@H]2C(O)c1ccc(Cl)cc1)-c1ccc(F)cc1
: