Target
Mu-type opioid receptor
Ligand
BDBM50017686
Substrate
Meas. Tech.
ChEMBL_303543 (CHEMBL839748)
Ki
0.11±n/a nM
Citation
 Chen, ZDavies, EMiller, WSShan, SValenzano, KJKyle, DJ Design and synthesis of 4-phenyl piperidine compounds targeting the mu receptor. Bioorg Med Chem Lett 14:5275-9 (2004)  
Target
Name:
Mu-type opioid receptor
Synonyms:
M-OR-1 MOR-1 MUOR1 Mu opiate receptor OPRM1 hMOP | mu-type opioid receptor isoform MOR-1
Type:
G Protein-Coupled Receptor (GPCR)
Mol. Mass.:
44789.51
Organism:
Homo sapiens (Human)
Description:
P35372
Residue:
400
  
Inhibitor
Name:
BDBM50017686
Synonyms:
4-[4-(4-Chloro-3-trifluoromethyl-phenyl)-4-hydroxy-piperidin-1-yl]-N,N-dimethyl-2,2-diphenyl-butyramide Fluperamide
Type:
Small organic molecule
Emp. Form.:
C30H32ClF3N2O2
Mol. Mass.:
545.035
SMILES:
CN(C)C(=O)C(CCN1CCC(O)(CC1)c1ccc(Cl)c(c1)C(F)(F)F)(c1ccccc1)c1ccccc1
: