Target
Geranylgeranyl transferase type-1 subunit beta/Protein farnesyltransferase/geranylgeranyltransferase type-1 subunit alpha
Ligand
BDBM50153774
Substrate
Meas. Tech.
ChEMBL_305246 (CHEMBL833504)
IC50
220±n/a nM
Citation
 Li, QWang, GTLi, TGwaltney, SLWoods, KWClaiborne, AWang, XGu, WCohen, JStoll, VSHutchins, CFrost, DRosenberg, SHSham, HL Synthesis and activity of 1-aryl-1'-imidazolyl methyl ethers as non-thiol farnesyltransferase inhibitors. Bioorg Med Chem Lett 14:5371-6 (2004)  
Target
Name:
Geranylgeranyl transferase type-1 subunit beta/Protein farnesyltransferase/geranylgeranyltransferase type-1 subunit alpha
Synonyms:
Geranylgeranyl Transferase (GGTase-I) Geranylgeranyl transferase type I
Type:
Protein Complex
Mol. Mass.:
Description:
Components:
This complex has 2 components.
Component 1
Name:
Protein farnesyltransferase/geranylgeranyltransferase type-1 subunit alpha
Synonyms:
CAAX farnesyltransferase alpha subunit FNTA_BOVIN GGTase-I-alpha Protein Farnesyltransferase (PFT) Chain A Protein farnesyltransferase/geranylgeranyltransferase type I alpha subunit Type I protein geranyl-geranyltransferase alpha subunit
Type:
Enzyme
Mol. Mass.:
43827.38
Organism:
Bos taurus (bovine)
Description:
The enzyme was purified from a bovine brain homogenate by sequential ammonium sulfate fractionation and affinity chromatography.
Residue:
375
  
Component 2
Name:
Geranylgeranyl transferase type-1 subunit beta
Synonyms:
GGTase-I-beta Geranylgeranyl transferase type-1 subunit beta PGTB1_BOVIN | Type I protein geranyl-geranyltransferase subunit beta
Type:
Enzyme
Mol. Mass.:
42483.88
Organism:
Bos taurus (bovine)
Description:
Purified from bovine brain
Residue:
377
  
Inhibitor
Name:
BDBM50153774
Synonyms:
4-(((1-(4-cyanobenzyl)-1H-imidazol-5-yl)methylamino)methyl)-2-(naphthalen-1-yl)benzonitrile CHEMBL184044
Type:
Small organic molecule
Emp. Form.:
C30H23N5
Mol. Mass.:
453.5371
SMILES:
N#Cc1ccc(Cn2cncc2CNCc2ccc(C#N)c(c2)-c2cccc3ccccc23)cc1
: