Target
Protein farnesyltransferase subunit beta/geranylgeranyltransferase type-1 subunit alpha
Ligand
BDBM50153785
Substrate
Meas. Tech.
ChEMBL_310472 (CHEMBL834416)
EC50
1.2±n/a nM
Citation
 Li, QWang, GTLi, TGwaltney, SLWoods, KWClaiborne, AWang, XGu, WCohen, JStoll, VSHutchins, CFrost, DRosenberg, SHSham, HL Synthesis and activity of 1-aryl-1'-imidazolyl methyl ethers as non-thiol farnesyltransferase inhibitors. Bioorg Med Chem Lett 14:5371-6 (2004)  
Target
Name:
Protein farnesyltransferase subunit beta/geranylgeranyltransferase type-1 subunit alpha
Synonyms:
Protein farnesyltransferase | Protein farnesyltransferase beta/geranylgeranyltransferase type I alpha subunit
Type:
Mol. Mass.:
Description:
ASSAY_ID of EBI is 38702
Components:
This complex has 2 components.
Component 1
Name:
Protein farnesyltransferase/geranylgeranyltransferase type-1 subunit alpha
Synonyms:
CAAX farnesyltransferase subunit alpha FTase-alpha GGTase-I-alpha Protein farnesyltransferase/geranylgeranyltransferase type-1 subunit alpha Type I protein geranyl-geranyltransferase subunit alpha
Type:
PROTEIN
Mol. Mass.:
43994.09
Organism:
Mus musculus
Description:
EBI_10570
Residue:
377
  
Component 2
Name:
Protein farnesyltransferase subunit beta
Synonyms:
FNTB_MOUSE Protein farnesyltransferase
Type:
PROTEIN
Mol. Mass.:
48811.61
Organism:
Mus musculus
Description:
EBI_12341
Residue:
437
  
Inhibitor
Name:
BDBM50153785
Synonyms:
4-((1-(4-cyanobenzyl)-1H-imidazol-5-yl)methoxy)-2-(naphthalen-1-yl)benzonitrile CHEMBL187128
Type:
Small organic molecule
Emp. Form.:
C29H20N4O
Mol. Mass.:
440.4953
SMILES:
N#Cc1ccc(Cn2cncc2COc2ccc(C#N)c(c2)-c2cccc3ccccc23)cc1
: