Target
C-C chemokine receptor type 2
Ligand
BDBM50153938
Substrate
Meas. Tech.
ChEMBL_310494 (CHEMBL834068)
EC50
610±n/a nM
Citation
 Moree, WJKataoka, KRamirez-Weinhouse, MMShiota, TImai, MSudo, MTsutsumi, TEndo, NMuroga, YHada, TTanaka, HMorita, TGreene, JBarnum, DSaunders, JKato, YMyers, PLTarby, CM Small molecule antagonists of the CCR2b receptor. Part 2: Discovery process and initial structure-activity relationships of diamine derivatives. Bioorg Med Chem Lett 14:5413-6 (2004)  
Target
Name:
C-C chemokine receptor type 2
Synonyms:
C-C chemokine receptor type 2 (CCR2) CCR2_HUMAN Chemoattractant Cytokine Receptor 2 (CCR2) Monocyte chemotactic protein-1 (MCP-1)
Type:
Enzyme
Mol. Mass.:
41932.32
Organism:
Homo sapiens (Human)
Description:
P41597
Residue:
374
  
Inhibitor
Name:
BDBM50153938
Synonyms:
CHEMBL181432 | N-{[1-(4-Chloro-benzyl)-piperidin-3-ylcarbamoyl]-methyl}-3-trifluoromethyl-benzamide
Type:
Small organic molecule
Emp. Form.:
C22H23ClF3N3O2
Mol. Mass.:
453.885
SMILES:
FC(F)(F)c1cccc(c1)C(=O)NCC(=O)NC1CCCN(Cc2ccc(Cl)cc2)C1
: