Target
Mu-type opioid receptor
Ligand
BDBM50154040
Substrate
Meas. Tech.
ChEMBL_310387 (CHEMBL834471)
EC50
>10000±n/a nM
Citation
 Breslin, HJMiskowski, TARafferty, BMCoutinho, SVPalmer, JMWallace, NHSchneider, CRKimball, ESZhang, SPLi, JColburn, RWStone, DJMartinez, RPHe, W Rationale, design, and synthesis of novel phenyl imidazoles as opioid receptor agonists for gastrointestinal disorders. J Med Chem 47:5009-20 (2004)  
Target
Name:
Mu-type opioid receptor
Synonyms:
M-OR-1 Mu opioid receptor OPIATE Mu OPRM_CAVPO
Type:
Enzyme Catalytic Domain
Mol. Mass.:
11165.58
Organism:
GUINEA PIG
Description:
P97266
Residue:
98
  
Inhibitor
Name:
BDBM50154040
Synonyms:
2-Amino-1-[3-(1H-benzoimidazol-2-yl)-3,4-dihydro-1H-isoquinolin-2-yl]-3-(4-hydroxy-phenyl)-propan-1-one | CHEMBL362514
Type:
Small organic molecule
Emp. Form.:
C25H24N4O2
Mol. Mass.:
412.4837
SMILES:
N[C@@H](Cc1ccc(O)cc1)C(=O)N1Cc2ccccc2C[C@H]1c1nc2ccccc2[nH]1
: