Target
Mu-type opioid receptor
Ligand
BDBM50154039
Substrate
Meas. Tech.
ChEMBL_302750 (CHEMBL852357)
Ki
12±n/a nM
Citation
 Breslin, HJMiskowski, TARafferty, BMCoutinho, SVPalmer, JMWallace, NHSchneider, CRKimball, ESZhang, SPLi, JColburn, RWStone, DJMartinez, RPHe, W Rationale, design, and synthesis of novel phenyl imidazoles as opioid receptor agonists for gastrointestinal disorders. J Med Chem 47:5009-20 (2004)  
Target
Name:
Mu-type opioid receptor
Synonyms:
MOR-1 Mu-type opioid receptor (MOR) OPRM_RAT Opioid receptor B Ror-b
Type:
G Protein-Coupled Receptor (GPCR)
Mol. Mass.:
44503.11
Organism:
Rattus norvegicus (rat)
Description:
Competition binding assays were carried out using membrane preparations from transfected HN9.10 cells that constitutively expressed the mu opioid receptor.
Residue:
398
  
Inhibitor
Name:
BDBM50154039
Synonyms:
2-Amino-1-[3-(5-bromo-4-phenyl-1H-imidazol-2-yl)-3,4-dihydro-1H-isoquinolin-2-yl]-3-(4-hydroxy-phenyl)-propan-1-one | CHEMBL408680
Type:
Small organic molecule
Emp. Form.:
C27H25BrN4O2
Mol. Mass.:
517.417
SMILES:
N[C@@H](Cc1ccc(O)cc1)C(=O)N1Cc2ccccc2C[C@H]1c1nc(c(Br)[nH]1)-c1ccccc1
: