Target
Integrin alpha-L/beta-2
Ligand
BDBM50154492
Substrate
Meas. Tech.
ChEMBL_302249 (CHEMBL830265)
Kd
30±n/a nM
Citation
 Wu, JPEmeigh, JGao, DAGoldberg, DRKuzmich, DMiao, CPotocki, IQian, KCSorcek, RJJeanfavre, DDKishimoto, KMainolfi, EANabozny, GPeng, CReilly, PRothlein, RSellati, RHWoska, JRChen, SGunn, JAO'Brien, DNorris, SHKelly, TA Second-generation lymphocyte function-associated antigen-1 inhibitors: 1H-imidazo[1,2-alpha]imidazol-2-one derivatives. J Med Chem 47:5356-66 (2004)  
Target
Name:
Integrin alpha-L/beta-2
Synonyms:
Integrin alpha-L/beta-2 (LFA-1) | Integrin beta-2/Leukocyte adhesion glycoprotein LFA-1 alpha
Type:
Mol. Mass.:
Description:
ASSAY_ID of EBI is 32646
Components:
This complex has 2 components.
Component 1
Name:
Integrin alpha-L
Synonyms:
CD11 antigen-like family member A CD_antigen=CD11a ITGAL LFA-1A Leukocyte adhesion glycoprotein LFA-1 alpha chain | Leukocyte function-associated molecule 1 alpha chain
Type:
PROTEIN
Mol. Mass.:
128748.90
Organism:
Homo sapiens (Human)
Description:
ChEMBL_629045
Residue:
1170
  
Component 2
Name:
Integrin beta-2
Synonyms:
CD18 ITGB2 MFI7
Type:
PROTEIN
Mol. Mass.:
84785.60
Organism:
Homo sapiens (Human)
Description:
EBI_12662
Residue:
769
  
Inhibitor
Name:
BDBM50154492
Synonyms:
CHEMBL188615 | N-{3-[(R)-5-(4-Bromo-benzyl)-7-(3,5-dichloro-phenyl)-5-methyl-6-oxo-6,7-dihydro-5H-imidazo[1,2-a]imidazole-3-sulfonyl]-propyl}-acetamide
Type:
Small organic molecule
Emp. Form.:
C24H23BrCl2N4O4S
Mol. Mass.:
614.339
SMILES:
CC(=O)NCCCS(=O)(=O)c1cnc2N(C(=O)[C@@](C)(Cc3ccc(Br)cc3)n12)c1cc(Cl)cc(Cl)c1
: