Target
Tyrosine-protein kinase
Ligand
BDBM50154584
Substrate
Meas. Tech.
ChEMBL_304473 (CHEMBL832689)
EC50
150000±n/a nM
Citation
 Inglis, SRStojkoski, CBranson, KMCawthray, JFFritz, DWiadrowski, EPyke, SMBooker, GW Identification and specificity studies of small-molecule ligands for SH3 protein domains. J Med Chem 47:5405-17 (2004)  
Target
Name:
Tyrosine-protein kinase
Synonyms:
Q8CFK4_MOUSE Tyrosine-protein kinase TEC
Type:
PROTEIN
Mol. Mass.:
71010.89
Organism:
Mus musculus
Description:
ChEMBL_304473
Residue:
608
  
Inhibitor
Name:
BDBM50154584
Synonyms:
6-Fluoro-quinolin-2-ylamine | CHEMBL185917
Type:
Small organic molecule
Emp. Form.:
C9H7FN2
Mol. Mass.:
162.1637
SMILES:
Nc1ccc2cc(F)ccc2n1
: