Target
Choline kinase alpha
Ligand
BDBM50154642
Substrate
Meas. Tech.
ChEMBL_304634 (CHEMBL828518)
IC50
8800.0±n/a nM
Citation
 Conejo-García, ABáñez-Coronel, MSánchez-Martín, RMRodríguez-González, ARamos, ARamírez de Molina, AEspinosa, AGallo, MACampos, JMLacal, JC Influence of the linker in bispyridium compounds on the inhibition of human choline kinase. J Med Chem 47:5433-40 (2004)  
Target
Name:
Choline kinase alpha
Synonyms:
CHK CHKA_HUMAN Choline kinase alpha
Type:
PROTEIN
Mol. Mass.:
52248.44
Organism:
Homo sapiens (Human)
Description:
ChEMBL_1290064
Residue:
457
  
Inhibitor
Name:
BDBM50154642
Synonyms:
4-hexahydro-1-pyridinyl-1-{4-[4-(4-hexahydro-1-pyridinyl-1-pyridiniumylmethyl)phenyl]benzyl}pyridinium; dibromide | CHEMBL186136
Type:
Small organic molecule
Emp. Form.:
C34H40N4
Mol. Mass.:
504.7071
SMILES:
C(c1ccc(cc1)-c1ccc(Cn2ccc(cc2)=[N+]2CCCCC2)cc1)n1ccc(cc1)=[N+]1CCCCC1
: